Dmitry Stogov (ex_trustnee) wrote in kluje,
Dmitry Stogov
ex_trustnee
kluje

  • Music:

New errors :(

./configure is done, but now I see new error :( I try to do "make" and it tells me:


stix:/home/dante/dist/internet/lj/kluje-0.7# make
make all-recursive
make[1]: Entering directory `/home/dante/dist/internet/lj/kluje-0.7'
Making all in kluje
make[2]: Entering directory `/home/dante/dist/internet/lj/kluje-0.7/kluje'
g++ -DHAVE_CONFIG_H -I. -I. -I.. -I/usr/include/kde -I/usr/local/qt/include -I/usr/X11R6/include -DQT_THREAD_SUPPORT -D_REENTRANT -O2 -fno-exceptions -fno-check-new -c klujeio.cpp
In file included from /usr/include/kde/kconfig.h:31,
from klujeio.h:28,
from kluje.h:25,
from klujeio.cpp:18:
/usr/include/kde/kconfigbase.h:1161: error: `void KConfigBase::writeEntry(const
QString&, long int, bool, bool, bool)' and `void
KConfigBase::writeEntry(const QString&, long int, bool, bool, bool)' cannot
be overloaded
/usr/include/kde/kconfigbase.h:1178: error: `void KConfigBase::writeEntry(const
char*, long int, bool, bool, bool)' and `void KConfigBase::writeEntry(const
char*, long int, bool, bool, bool)' cannot be overloaded
/usr/include/kde/kconfigbase.h:1196: error: `void KConfigBase::writeEntry(const
QString&, long unsigned int, bool, bool, bool)' and `void
KConfigBase::writeEntry(const QString&, long unsigned int, bool, bool, bool)
' cannot be overloaded
/usr/include/kde/kconfigbase.h:1213: error: `void KConfigBase::writeEntry(const
char*, long unsigned int, bool, bool, bool)' and `void
KConfigBase::writeEntry(const char*, long unsigned int, bool, bool, bool)'
cannot be overloaded
In file included from /usr/include/kde/kcompletion.h:33,
from /usr/include/kde/klineedit.h:34,
from preferencesdialog.h:19,
from kluje.h:28,
from klujeio.cpp:18:
/usr/include/kde/kshortcut.h:47: error: `META' is not a member of type `Qt'
/usr/include/kde/kshortcut.h:47: error: enumerator value for `QtWIN' not
integer constant
In file included from /usr/include/c++/3.3/backward/iostream.h:31,
from editeventsdialog.h:35,
from kluje.h:29,
from klujeio.cpp:18:
/usr/include/c++/3.3/backward/backward_warning.h:32:2: warning: #warning This file includes at least one deprecated or antiquated header. Please consider using one of the 32 headers found in section 17.4.1.2 of the C++ standard. Examples include substituting the header for the
[Error: Irreparable invalid markup ('<x.h>') in entry. Owner must fix manually. Raw contents below.]

./configure is done, but now I see new error :( I try to do "make" and it tells me:

<lj-cut text="errors">
stix:/home/dante/dist/internet/lj/kluje-0.7# make
make all-recursive
make[1]: Entering directory `/home/dante/dist/internet/lj/kluje-0.7'
Making all in kluje
make[2]: Entering directory `/home/dante/dist/internet/lj/kluje-0.7/kluje'
g++ -DHAVE_CONFIG_H -I. -I. -I.. -I/usr/include/kde -I/usr/local/qt/include -I/usr/X11R6/include -DQT_THREAD_SUPPORT -D_REENTRANT -O2 -fno-exceptions -fno-check-new -c klujeio.cpp
In file included from /usr/include/kde/kconfig.h:31,
from klujeio.h:28,
from kluje.h:25,
from klujeio.cpp:18:
/usr/include/kde/kconfigbase.h:1161: error: `void KConfigBase::writeEntry(const
QString&, long int, bool, bool, bool)' and `void
KConfigBase::writeEntry(const QString&, long int, bool, bool, bool)' cannot
be overloaded
/usr/include/kde/kconfigbase.h:1178: error: `void KConfigBase::writeEntry(const
char*, long int, bool, bool, bool)' and `void KConfigBase::writeEntry(const
char*, long int, bool, bool, bool)' cannot be overloaded
/usr/include/kde/kconfigbase.h:1196: error: `void KConfigBase::writeEntry(const
QString&, long unsigned int, bool, bool, bool)' and `void
KConfigBase::writeEntry(const QString&, long unsigned int, bool, bool, bool)
' cannot be overloaded
/usr/include/kde/kconfigbase.h:1213: error: `void KConfigBase::writeEntry(const
char*, long unsigned int, bool, bool, bool)' and `void
KConfigBase::writeEntry(const char*, long unsigned int, bool, bool, bool)'
cannot be overloaded
In file included from /usr/include/kde/kcompletion.h:33,
from /usr/include/kde/klineedit.h:34,
from preferencesdialog.h:19,
from kluje.h:28,
from klujeio.cpp:18:
/usr/include/kde/kshortcut.h:47: error: `META' is not a member of type `Qt'
/usr/include/kde/kshortcut.h:47: error: enumerator value for `QtWIN' not
integer constant
In file included from /usr/include/c++/3.3/backward/iostream.h:31,
from editeventsdialog.h:35,
from kluje.h:29,
from klujeio.cpp:18:
/usr/include/c++/3.3/backward/backward_warning.h:32:2: warning: #warning This file includes at least one deprecated or antiquated header. Please consider using one of the 32 headers found in section 17.4.1.2 of the C++ standard. Examples include substituting the <X> header for the <X.h> header for C++ includes, or <sstream> instead of the deprecated header <strstream.h>. To disable this warning use -Wno-deprecated.
In file included from editeventsdialog.h:41,
from kluje.h:29,
from klujeio.cpp:18:
/usr/include/kde/kdebug.h:182: error: `Q_LLONG' was not declared in this scope
/usr/include/kde/kdebug.h:182: error: parse error before `)' token
/usr/include/kde/kdebug.h:182: error: `kdbgstream& kdbgstream::operator<<(...)'
must take exactly one argument
/usr/include/kde/kdebug.h:192: error: `Q_ULLONG' was not declared in this scope
/usr/include/kde/kdebug.h:192: error: parse error before `)' token
/usr/include/kde/kdebug.h:192: error: `kdbgstream& kdbgstream::operator<<(...)'
must take exactly one argument
/usr/include/kde/kdebug.h:192: error: `kdbgstream& kdbgstream::operator<<(...)'
and `kdbgstream& kdbgstream::operator<<(...)' cannot be overloaded
/usr/include/kde/kdebug.h: In member function `kdbgstream&
kdbgstream::operator<<(...)':
/usr/include/kde/kdebug.h:184: error: `i' undeclared (first use this function)
/usr/include/kde/kdebug.h:184: error: (Each undeclared identifier is reported
only once for each function it appears in.)
/usr/include/kde/kdebug.h: At global scope:
/usr/include/kde/kdebug.h:535: error: `Q_LLONG' was not declared in this scope
/usr/include/kde/kdebug.h:535: error: variable declaration is not allowed here
/usr/include/kde/kdebug.h:535: error: syntax error before `{' token
/usr/include/kde/kdebug.h:540: error: ISO C++ forbids defining types within
return type
/usr/include/kde/kdebug.h:540: error: syntax error before `&' token
/usr/include/kde/kdebug.h:545: error: `kndbgstream&
operator<<(kndbgstream&(*)(kndbgstream&))' must have an argument of class or
enumerated type
/usr/include/kde/kdebug.h:545: error: `kndbgstream&
operator<<(kndbgstream&(*)(kndbgstream&))' must take exactly two arguments
/usr/include/kde/kdebug.h: In function `kndbgstream&
operator<<(kndbgstream&(*)(kndbgstream&))':
/usr/include/kde/kdebug.h:545: error: invalid use of `this' in non-member
function
/usr/include/kde/kdebug.h: At global scope:
/usr/include/kde/kdebug.h:550: error: `kndbgstream& operator<<(const QWidget*)'
must have an argument of class or enumerated type
/usr/include/kde/kdebug.h:550: error: `kndbgstream& operator<<(const QWidget*)'
must take exactly two arguments
/usr/include/kde/kdebug.h: In function `kndbgstream& operator<<(const QWidget*)
':
/usr/include/kde/kdebug.h:550: error: invalid use of `this' in non-member
function
/usr/include/kde/kdebug.h: At global scope:
/usr/include/kde/kdebug.h:551: error: `kndbgstream& operator<<(QWidget*)' must
have an argument of class or enumerated type
/usr/include/kde/kdebug.h:551: error: `kndbgstream& operator<<(QWidget*)' must
take exactly two arguments
/usr/include/kde/kdebug.h: In function `kndbgstream& operator<<(QWidget*)':
/usr/include/kde/kdebug.h:551: error: invalid use of `this' in non-member
function
/usr/include/kde/kdebug.h: In function `kndbgstream& form(const char*, ...)':
/usr/include/kde/kdebug.h:556: error: invalid use of `this' in non-member
function
/usr/include/kde/kdebug.h: At global scope:
/usr/include/kde/kdebug.h:558: error: `kndbgstream& operator<<(const
QDateTime&)' must take exactly two arguments
/usr/include/kde/kdebug.h: In function `kndbgstream& operator<<(const
QDateTime&)':
/usr/include/kde/kdebug.h:558: error: invalid use of `this' in non-member
function
/usr/include/kde/kdebug.h: At global scope:
/usr/include/kde/kdebug.h:559: error: `kndbgstream& operator<<(const QDate&)'
must take exactly two arguments
/usr/include/kde/kdebug.h: In function `kndbgstream& operator<<(const QDate&)':
/usr/include/kde/kdebug.h:559: error: invalid use of `this' in non-member
function
/usr/include/kde/kdebug.h: At global scope:
/usr/include/kde/kdebug.h:560: error: `kndbgstream& operator<<(const QTime&)'
must take exactly two arguments
/usr/include/kde/kdebug.h: In function `kndbgstream& operator<<(const QTime&)':
/usr/include/kde/kdebug.h:560: error: invalid use of `this' in non-member
function
/usr/include/kde/kdebug.h: At global scope:
/usr/include/kde/kdebug.h:561: error: `kndbgstream& operator<<(const QPoint&)'
must take exactly two arguments
/usr/include/kde/kdebug.h: In function `kndbgstream& operator<<(const QPoint&)
':
/usr/include/kde/kdebug.h:561: error: invalid use of `this' in non-member
function
/usr/include/kde/kdebug.h: At global scope:
/usr/include/kde/kdebug.h:562: error: `kndbgstream& operator<<(const QSize&)'
must take exactly two arguments
/usr/include/kde/kdebug.h: In function `kndbgstream& operator<<(const QSize&)':
/usr/include/kde/kdebug.h:562: error: invalid use of `this' in non-member
function
/usr/include/kde/kdebug.h: At global scope:
/usr/include/kde/kdebug.h:563: error: `kndbgstream& operator<<(const QRect&)'
must take exactly two arguments
/usr/include/kde/kdebug.h: In function `kndbgstream& operator<<(const QRect&)':
/usr/include/kde/kdebug.h:563: error: invalid use of `this' in non-member
function
/usr/include/kde/kdebug.h: At global scope:
/usr/include/kde/kdebug.h:564: error: `kndbgstream& operator<<(const QRegion&)'
must take exactly two arguments
/usr/include/kde/kdebug.h: In function `kndbgstream& operator<<(const QRegion&)
':
/usr/include/kde/kdebug.h:564: error: invalid use of `this' in non-member
function
/usr/include/kde/kdebug.h: At global scope:
/usr/include/kde/kdebug.h:565: error: `kndbgstream& operator<<(const KURL&)'
must take exactly two arguments
/usr/include/kde/kdebug.h: In function `kndbgstream& operator<<(const KURL&)':
/usr/include/kde/kdebug.h:565: error: invalid use of `this' in non-member
function
/usr/include/kde/kdebug.h: At global scope:
/usr/include/kde/kdebug.h:566: error: `kndbgstream& operator<<(const
QStringList&)' must take exactly two arguments
/usr/include/kde/kdebug.h: In function `kndbgstream& operator<<(const
QStringList&)':
/usr/include/kde/kdebug.h:566: error: invalid use of `this' in non-member
function
/usr/include/kde/kdebug.h: At global scope:
/usr/include/kde/kdebug.h:567: error: `kndbgstream& operator<<(const QColor&)'
must take exactly two arguments
/usr/include/kde/kdebug.h: In function `kndbgstream& operator<<(const QColor&)
':
/usr/include/kde/kdebug.h:567: error: invalid use of `this' in non-member
function
/usr/include/kde/kdebug.h: At global scope:
/usr/include/kde/kdebug.h:568: error: `kndbgstream& operator<<(const QPen&)'
must take exactly two arguments
/usr/include/kde/kdebug.h: In function `kndbgstream& operator<<(const QPen&)':
/usr/include/kde/kdebug.h:568: error: invalid use of `this' in non-member
function
/usr/include/kde/kdebug.h: At global scope:
/usr/include/kde/kdebug.h:569: error: `kndbgstream& operator<<(const QBrush&)'
must take exactly two arguments
/usr/include/kde/kdebug.h: In function `kndbgstream& operator<<(const QBrush&)
':
/usr/include/kde/kdebug.h:569: error: invalid use of `this' in non-member
function
/usr/include/kde/kdebug.h: At global scope:
/usr/include/kde/kdebug.h:570: error: `kndbgstream& operator<<(const QVariant&)
' must take exactly two arguments
/usr/include/kde/kdebug.h: In function `kndbgstream& operator<<(const
QVariant&)':
/usr/include/kde/kdebug.h:570: error: invalid use of `this' in non-member
function
/usr/include/kde/kdebug.h: At global scope:
/usr/include/kde/kdebug.h:571: error: `kndbgstream& operator<<(const
QByteArray&)' must take exactly two arguments
/usr/include/kde/kdebug.h: In function `kndbgstream& operator<<(const
QByteArray&)':
/usr/include/kde/kdebug.h:571: error: invalid use of `this' in non-member
function
/usr/include/kde/kdebug.h: At global scope:
/usr/include/kde/kdebug.h:574: error: `kndbgstream& operator<<(const
QValueList<T>&)' must take exactly two arguments
/usr/include/kde/kdebug.h: In function `kndbgstream& operator<<(const
QValueList<T>&)':
/usr/include/kde/kdebug.h:574: error: invalid use of `this' in non-member
function
/usr/include/kde/kdebug.h: At global scope:
/usr/include/kde/kdebug.h:575: error: parse error before `}' token
/usr/include/kde/kdebug.h:619: error: semicolon missing after declaration of `
class kndbgstream'
/usr/include/kde/kdebug.h: In function `int kndDebug(int)':
/usr/include/kde/kdebug.h:619: error: cannot convert `kndbgstream' to `int' in
return
make[2]: *** [klujeio.o] Error 1
make[2]: Leaving directory `/home/dante/dist/internet/lj/kluje-0.7/kluje'
make[1]: *** [all-recursive] Error 1
make[1]: Leaving directory `/home/dante/dist/internet/lj/kluje-0.7'
make: *** [all-recursive-am] Error 2

:((( That can I do with it? :(((
  • Post a new comment

    Error

    default userpic
  • 4 comments